{"text_format":"3","workbook":"xlsx","n_sheets":5,"sheets":["dati impostazione","Maschera di Calcolo","Pagamento accoppiato","Diversificazione","EFA"],"not_rendered":{"charts":9,"images":1,"macros":1,"defined_names":3,"comments":1},"read":"whole","date_system":"1900"}

{"sheet":"dati impostazione","index":0,"n_rows":31,"n_cols":5,"rows_kept":31}
["Dati"]
["SAU ammissibile in IT",null,"ha",{"v":12000000,"d":"12,000,000"}]
["Massimale IT",2014,"euro",{"v":3953394000,"d":"3,953,394,000"}]
[null,2015,"euro",{"v":3902039000,"d":"3,902,039,000"}]
[null,2016,"euro",{"v":3850805000,"d":"3,850,805,000"}]
[null,2017,"euro",{"v":3799540000,"d":"3,799,540,000"}]
[null,2018,"euro",{"v":3751937000,"d":"3,751,937,000"}]
[null,2019,"euro",{"v":3704337000,"d":"3,704,337,000"}]
[null,2020,"euro",{"v":3704337000,"d":"3,704,337,000"}]
[]
["Massimale 2013 (allegato VIII, Reg. 914/2013)",null,"euro",{"v":4379985000,"d":"4,379,985,000"}]
["Massimale 2014 (allegato VIII, Reg. 1310/2013)",null,"euro",{"$f":"+D3","v":{"v":3953394000,"d":"3,953,394,000"}}]
["Mssimale regime di pagamento unico (Reg. 1044/2014)",null,"euro",{"v":3769644000,"d":"3,769,644,000"}]
["Riduzione massimale",null,"%",8.41]
["Riduzione disciplina finanziaria",null,"%",{"v":0.01302214,"d":"1.302214%"}]
[]
["REGIONE UNICA"]
["Percentuale pagamento di base",null,"%",{"$f":"(1-0.3-0.11-D24-0.0174)*1.03","v":{"v":0.579478,"d":"57.95%"}},"58% base, 30% greening, 1% giovani, 11% accoppiato, 1,74% riserva, +3% overbooking massimale"]
["Massimale nazionale pagamento di base",null,"euro",{"$f":"+$D$4*D18","v":{"v":2261145755.642,"d":"2,261,145,756"}}]
["Importo pagamenti 2014",null,"euro",{"$f":"+$D$12","v":{"v":3953394000,"d":"3,953,394,000"}}]
["X / Y",null,"%",{"$f":"+D19/D20","v":{"v":0.5719505203989281,"d":"57.2%"}}]
["VUN",null,"euro/ha",{"$f":"+$D$8/$D$2*D18","v":{"v":178.88181634050002,"d":"179"}}]
["GIOVANE AGRICOLTORE"]
["Percentuale del massimale",null,"%",{"v":0.01,"d":"1.00%"}]
["Condizione",null,"Si","No"]
[]
[null,"Autori: Angelo Frascarelli, Gabriele Chiodini, Stefano Ciliberti"]
[]
[]
["Informativa sulla licenza: ","http://creativecommons.org/licenses/by-nc-sa/4.0/legalcode"]
["Informativa sull'esonero da responsabilità:","http://creativecommons.org/licenses/by-nc-sa/4.0/"]

{"sheet":"Maschera di Calcolo","index":1,"n_rows":90,"n_cols":14,"rows_kept":90,"merged":[[0,0,0,8],[0,9,0,25],[1,2,1,4],[2,0,2,7],[3,0,3,1],[4,0,4,1],[5,0,5,1],[6,0,6,1],[7,0,7,1],[8,0,8,1],[9,0,9,1],[10,0,10,1],[11,0,11,1],[11,6,14,7],[12,0,12,1],[13,0,13,1],[14,0,14,1],[15,0,15,1],[16,0,16,1],[17,0,17,1],[18,0,18,1],[19,0,19,1],[20,0,20,2],[21,0,21,1],[22,0,22,1],[23,0,23,1],[24,0,24,1],[25,0,27,0],[25,1,25,3],[25,4,25,7],[26,1,26,3],[27,1,27,3],[28,0,28,3],[29,0,29,1],[30,0,30,1],[31,0,31,1],[32,0,32,1],[33,0,33,1],[34,0,34,1],[35,0,35,1],[36,0,36,1],[37,0,37,1],[38,0,38,1],[39,0,39,1],[41,0,41,1],[59,0,59,1],[60,0,60,1],[61,0,61,1],[66,0,66,7],[67,0,67,1],[68,0,68,1],[69,0,69,1],[70,0,70,1],[71,0,71,1],[76,0,76,1],[77,0,77,1],[78,0,78,1],[79,0,79,1],[83,0,83,7]]}
["MASCHERA DI CALCOLO DEI PAGAMENTI DIRETTI 2014-2020",{"$nulls":8},"GRAFICO DEL RISULTATO"]
[null,"dell'azienda:"]
["® Angelo Frascarelli, Gabriele Chiodini, Stefano Ciliberti"]
["DATI DI INPUT",null,"U.M.","Valori"]
["Valore dei titoli al 01/12/2014 attivati dall'agricoltore",null,"euro",{"v":30000,"d":"30,000.00"},"(inserire valore valore titoli 2014 dopo riduzione del 8,41%)"]
["SAU 2014",null,"ettari",{"v":15,"d":"15.00"},"(inserire SAU domanda 2014)"]
["Valore medio dei titoli 2014",null,"euro",{"$f":"+IF(D5=0,\"n.d.\",D5/D6)","v":{"v":2000,"d":"2,000.00"}}]
["Articolo 68",null,"euro",null,"(immettere valore pagamenti ricevuti con art. 68)"]
["Rapporto ariticolo 68/valore dei titoli",null,"%",{"$f":"+D8/D12","v":{"v":0,"d":"0%"}}]
["Giovane agricoltore",null,"info","No","(immettere \"si\" se giovane agricoltore; altrimenti \"no\")"]
[{"$f":"+IF(D10=\"Si\", \"Da che anno è giovane agricoltore?\",\"\")","v":""},null,"anno",null," (prima del 2011; 2011; 2012; 2013; 2014; 2015; dal 2016)"]
["Totale pagamenti diretti",null,"euro",{"$f":"+D5+D8","v":{"v":30000,"d":"30,000.00"}},null,null,{"$f":"+IF(AND(D15<>0,D8=\"\"),\"Attenzione compilare anche la cella D8\",IF(D15>D8,\"Attenzione il valore della cella D15 deve essere minore o uguale di quello della cella D8\",\"\"))","v":""}]
["Riduzione disciplina finanziaria",null,"euro",{"$f":"IF(D12>2000,(D12-2000)*'dati impostazione'!$D$15,0)","v":{"v":364.61992,"d":"364.62"}}]
["Pagamenti ricevuti nel 2014",null,"euro",{"$f":"+D12-D13","v":{"v":29635.38008,"d":"29,635.38"}}]
["Articolo 68 compreso nel calcolo VUI",null,"euro",null,"(tabacco, patate, Danae Racemosa)"]
["Rapporto Artcolo 68 compreso nel VUI/Articolo 68 tot",null,"%",{"$f":"+D15/D8","v":{"$error":"#DIV/0!"}}]
["Pagamenti ricevuti nel 2014 - art. 26 Reg. 1307/2013 (A)",null,"euro",{"$f":"+IF(D8=\"\",B49,B49+D15-D13*D16*D9)","v":{"v":29635.38008,"d":"29,635.38"}}]
["Sostegno accoppiato (art. 52 reg. 1307/2013)",null,"euro",{"$f":"+'Pagamento accoppiato'!H24","v":0},"(compilare il foglio apposito)"]
["SAU 2015 (B)",null,"ettari",null,"(Inserire solo se diverso dal 2014)"]
["Valutare il rispetto del greening in relazione alle scelte?",null,"info","Premere qui"]
["Dal 2014 al 2015 la SAU si è ridotta per la scadenza di un contratto di affitto di durata inferiore ad 1 anno?",null,null,"No"]
["Inserire il costo del lavoro",null,"euro"]
["X / Y",null,"%",{"$f":"+'dati impostazione'!$D$21","v":{"v":0.5719505203989281,"d":"57.2%"}}]
["Valore unitario iniziale (X / Y) * (A / B)",null,"euro",{"$f":"+D23*D17/D30","v":{"v":1129.998070598402,"d":"1,130.00"}}]
["Tipo di criterio di calcolo",null,"euro",{"$f":"+IF(D31<-30,1,IF(D31<0,2,IF(D32>90,3,IF(D38>60,4,IF(D7=\"n.d.\",5,5)))))","v":1}]
["\nTipo di calcolo:",{"$f":"+IF(D25=1,\"Azienda che perde massimo il 30% del VUI\",IF(D25=2,\"Azienda che perde meno del 30% del VUI\",IF(D25=3,\"Azienda in cui il VUI è oltre il 90% del VUN\",IF(D25=4,\"Azienda in cui il VUI è meno del 90% del VUN ma al 2019 il VUI è superiore al 60% del VUN\",\"Azienda che deve raggiungere il 60% del VUN\"))))","v":"Azienda che perde massimo il 30% del VUI"}]
[null,{"$f":"+IF(D19=\"\",\"\",IF(OR(AND(D19<D6,D40>1000,D21=\"Si\"),AND(D19<D6,D21=\"No\")),\"ma che incorre negli effetti del guadagno insperato\",\"\"))","v":""},{"$nulls":5},"   "]
[null,{"$f":"+IF(OR(C46>150000,D46>150000,E46>150000,F46>150000,G46>150000,H46>150000),\"e che è soggetta alla riduzione dei pagamenti diretti (degressività)\",\"\")","v":""}]
[{"$nulls":5},"Cond.Rispetto greeing",{"$f":"+IF(D19=\"\",IF(D6>=10,\"Si\",\"No\"),IF(D19>=10,\"Si\",\"No\"))","v":"Si"}]
["SAU 2015",null,"ha",{"$f":"+IF(D19=\"\",D6,D19)","v":{"v":15,"d":"15.00"}},null,"Valutare il greening"]
["Variazione",null,"%",{"$f":"+IF(D7=\"n.d.\",\"parte da zero\",(D34-D33)/D33*100)","v":{"v":-84.169723737159,"d":"-84.17"}},null,"Rispetta il greening?","si"]
["Rapporto VUI 2015/VUN 2019",null,"%",{"$f":"+D33/D34*100","v":{"v":631.7009150038258,"d":"631.70"}}]
["VUI*SAU=PB 2015 (standard - VUI)",null,"euro",{"$f":"+(D24*D30)","v":{"v":16949.97105897603,"d":"16,950"}},null,"Degressività?",{"$f":"+IF(OR(C46>150000,D46>150000,E46>150000,F46>150000,G46>150000,H46>150000),\"si\",\"no\")","v":"no"}]
["VUN*SAU=PB 2019 (standard - VUN)",null,"euro",{"$f":"+'dati impostazione'!D22*'Maschera di Calcolo'!D30","v":{"v":2683.2272451075005,"d":"2,683.2"}}]
["VU*SAU=PB 2019 ridotto (riduzione del 70% del PB 2015)",null,"euro",{"$f":"+D24*D30*0.7","v":{"v":11864.97974128322,"d":"11,864.98"}},null,"Legenda = ","1 perdita oltre il 30 vui"]
["Differenza di 1/3 da recuperare tra VUI e 90%VUN",null,"euro",{"$f":"+(D34*0.9-D33)*(1/3)","v":{"v":-4845.022179459759,"d":"-4,845.02"}},null,null,"2 perdita sotto il 30 del vui"]
["PB 2019 (aumentato di 1/3 della differenza tra VUI e 90% VUN)",null,"euro",{"$f":"+D33+D36","v":{"v":12104.948879516269,"d":"12,104.95"}},null,null,"3 calcolo normale-nessuna variazione"]
["Rapporto VU 2019/VUN 2019",null,"%",{"$f":"+(D37/D30)/'dati impostazione'!D22*100","v":{"v":451.1339433358839,"d":"451.13"}},null,null,"4 aumento normale - perché VUI<90% VUN"]
["Soglia del 60% del PB",null,"euro",{"$f":"+D34*0.6","v":{"v":1609.9363470645003,"d":"1,610"}},null,null,"5 aumento forzato al 60% VUN"]
["Eventuale aumento da versare nella riserva per guadagno insperato",null,"euro",{"$f":"+(C44-C45)/2","v":{"v":7966.486397718733,"d":"7,966"}}]
[]
["Valore dei titoli di base dell'azienda (€)"]
["Anno",2014,2015,2016,2017,2018,2019,2020]
["Calcolati sulla SAU 2014",null,{"$f":"+IF($D$25=1,$D$35+(+$D$24*$D$30-$D$35)/5*4,IF($D$25=2,$D$34+($D$24*$D$30-$D$34)/5*4,IF($D$25=3,$D$33,IF($D$25=4,$D$33+$D$36/5*1,$D$33+($D$39-$D$33)/5*1))))","v":{"v":15932.972795437467,"d":"15,932.97"}},{"$f":"+IF($D$25=1,$D$35+(+$D$24*$D$30-$D$35)/5*3,IF($D$25=2,$D$34+($D$24*$D$30-$D$34)/5*3,IF($D$25=3,$D$33,IF($D$25=4,$D$33+$D$36/5*2,$D$33+($D$39-$D$33)/5*2))))","v":{"v":14915.974531898904,"d":"14,915.97"}},{"$f":"+IF($D$25=1,$D$35+(+$D$24*$D$30-$D$35)/5*2,IF($D$25=2,$D$34+($D$24*$D$30-$D$34)/5*2,IF($D$25=3,$D$33,IF($D$25=4,$D$33+$D$36/5*3,$D$33+($D$39-$D$33)/5*3))))","v":{"v":13898.976268360344,"d":"13,898.98"}},{"$f":"+IF($D$25=1,$D$35+(+$D$24*$D$30-$D$35)/5*1,IF($D$25=2,$D$34+($D$24*$D$30-$D$34)/5*1,IF($D$25=3,$D$33,IF($D$25=4,$D$33+$D$36/5*4,$D$33+($D$39-$D$33)/5*4))))","v":{"v":12881.978004821782,"d":"12,881.98"}},{"$f":"+IF($D$25=1,$D$35,IF($D$25=2,$D$34,IF($D$25=3,$D$33,IF($D$25=4,$D$33+$D$36,$D$39))))","v":{"v":11864.97974128322,"d":"11,864.98"}},{"$f":"+IF($D$25=1,$D$35,IF($D$25=2,$D$34,IF($D$25=3,$D$33,IF($D$25=4,$D$33+$D$36,$D$39))))","v":{"v":11864.97974128322,"d":"11,864.98"}}]
["Calcolati sulla SAU 2015",null,{"$f":"+C44/$D6*$D19","v":{"v":0,"d":"0.00"}},{"v":0,"d":"0.00"},{"v":0,"d":"0.00"},{"v":0,"d":"0.00"},{"v":0,"d":"0.00"},{"v":0,"d":"0.00"}]
["Reali (senza eventuale degressività)",null,{"$f":"+IF($D19=\"\",C44,IF(OR(AND($D19<$D6,$D40>1000,$D21=\"Si\"),AND($D19<$D6,$D21=\"No\")),(C44-C45)/2+C45,C44))","v":{"v":15932.972795437467,"d":"15,932.97"}},{"v":14915.974531898904,"d":"14,915.97"},{"v":13898.976268360344,"d":"13,898.98"},{"v":12881.978004821782,"d":"12,881.98"},{"v":11864.97974128322,"d":"11,864.98"},{"v":11864.97974128322,"d":"11,864.98"}]
["Pagamento di base (degressività 150000)",null,{"$f":"+IF(C46>(150000+$D22),((C46-(150000+$D22))/2+(150000+$D22)),C46)","v":{"v":15932.972795437467,"d":"15,932.97"}},{"v":14915.974531898904,"d":"14,915.97"},{"v":13898.976268360344,"d":"13,898.98"},{"v":12881.978004821782,"d":"12,881.98"},{"v":11864.97974128322,"d":"11,864.98"},{"v":11864.97974128322,"d":"11,864.98"}]
["Rimanenza costo del lavoro",null,{"$f":"+IF(C46=C47,$D22-(C47-150000),0)","v":{"v":134067.02720456253,"d":"134,067.03"}},{"v":135084.02546810108,"d":"135,084.03"},{"v":136101.02373163967,"d":"136,101.02"},{"v":137118.02199517822,"d":"137,118.02"},{"v":138135.02025871677,"d":"138,135.02"},{"v":138135.02025871677,"d":"138,135.02"}]
["Pagamento di base",{"$f":"+IF(D12>2000,D5-D13*(1-D9),D5)","v":{"v":29635.38008,"d":"29,635.38"}},{"$f":"+IF(C47>(500000+C48),(500000+C48),C47)","v":{"v":15932.972795437467,"d":"15,932.97"}},{"v":14915.974531898904,"d":"14,915.97"},{"v":13898.976268360344,"d":"13,898.98"},{"v":12881.978004821782,"d":"12,881.98"},{"v":11864.97974128322,"d":"11,864.98"},{"v":11864.97974128322,"d":"11,864.98"}]
["Greening",{"v":0,"d":"0.00"},{"$f":"+C46*0.3/$D23","v":{"v":8357.177182559999,"d":"8,357.18"}},{"v":7823.740341119999,"d":"7,823.74"},{"v":7290.303499680001,"d":"7,290.30"},{"v":6756.866658239999,"d":"6,756.87"},{"v":6223.4298168,"d":"6,223.43"},{"v":6223.4298168,"d":"6,223.43"}]
[]
["Anno",2014,2015,2016,2017,2018,2019,2020]
[null,"euro","euro","euro","euro","euro","euro","euro"]
["Pagamento di base",{"$f":"+B49","v":{"v":29635.38008,"d":"29,635.38"}},{"$f":"+C49","v":{"v":15932.972795437467,"d":"15,932.97"}},{"$f":"+D49","v":{"v":14915.974531898904,"d":"14,915.97"}},{"$f":"+IF(OR($G30=\"\",$G31=\"Si\"),E49,E49-E80)","v":{"v":13898.976268360344,"d":"13,898.98"}},{"$f":"+IF(OR($G30=\"\",$G31=\"Si\"),F49,F49-F80)","v":{"v":12881.978004821782,"d":"12,881.98"}},{"$f":"+IF(OR($G30=\"\",$G31=\"Si\"),G49,G49-G80)","v":{"v":11864.97974128322,"d":"11,864.98"}},{"$f":"+IF(OR($G30=\"\",$G31=\"Si\"),H49,H49-H80)","v":{"v":11864.97974128322,"d":"11,864.98"}}]
["Greening",{"v":0,"d":"0.00"},{"$f":"+IF(AND($G30=\"Si\",$G$31=\"No\"),C50/$D30*C79,C50)","v":{"v":8357.177182559999,"d":"8,357.18"}},{"v":7823.740341119999,"d":"7,823.74"},{"v":7290.303499680001,"d":"7,290.30"},{"v":6756.866658239999,"d":"6,756.87"},{"v":6223.4298168,"d":"6,223.43"},{"v":6223.4298168,"d":"6,223.43"}]
["Giovani agricoltori",{"v":0,"d":"0.00"},{"$f":"+IF(AND($D$10=\"si\",OR($D$11=2011,$D$11=2012,$D$11=2013,$D$11=2014,$D$11=2015)),IF($D$30<90,C$46*0.25,C$46/$D30*90*0.25),0)","v":{"v":0,"d":"0.00"}},{"$f":"+IF(AND($D$10=\"si\",OR($D$11=2012,$D$11=2013,$D$11=2014,$D$11=2015,$D$11=\"dal 2016\")),IF($D$30<90,D46*0.25,D46/D30*90*0.25),0)","v":{"v":0,"d":"0.00"}},{"$f":"+IF(AND($D$10=\"si\",OR(D11=2013,D11=2014,D11=2015,D11=\"dal 2016\")),IF($D$30<90,E46*0.25,E46/D30*90*0.25),0)","v":{"v":0,"d":"0.00"}},{"$f":"+IF(AND($D$10=\"si\",OR(D11=2014,D11=2015,D11=\"dal 2016\")),IF($D$30<90,F46*0.25,F46/D30*90*0.25),0)","v":{"v":0,"d":"0.00"}},{"$f":"+IF(AND($D$10=\"si\",OR(D11=2015,D11=\"dal 2016\")),IF($D$30<90,G46*0.25,G46/D30*90*0.25),0)","v":{"v":0,"d":"0.00"}},{"$f":"+IF(AND($D$10=\"si\",D11=\"dal 2016\"),IF($D$30<90,H46*0.25,H46/D30*90*0.25),0)","v":{"v":0,"d":"0.00"}}]
["Accoppiato",{"$f":"+IF(D12>2000,D8-D13*D9,D8)","v":{"v":0,"d":"0.00"}},{"$f":"+$D18","v":{"v":0,"d":"0.00"}},{"v":0,"d":"0.00"},{"v":0,"d":"0.00"},{"v":0,"d":"0.00"},{"v":0,"d":"0.00"},{"v":0,"d":"0.00"}]
["Totale pagamenti diretti",{"$f":"SUM(B54:B57)","v":{"v":29635.38008,"d":"29,635.38"}},{"v":24290.149977997466,"d":"24,290.15"},{"v":22739.714873018904,"d":"22,739.71"},{"v":21189.279768040346,"d":"21,189.28"},{"v":19638.84466306178,"d":"19,638.84"},{"v":18088.409558083218,"d":"18,088.41"},{"v":18088.409558083218,"d":"18,088.41"}]
["Variazione rispetto al 2014",null,{"$f":"+IF($B$58=0,\"n.d.\",(C58-$B58)/$B58)","v":{"v":-0.18036651082500757,"d":"-18%"}},{"v":-0.23268354204894326,"d":"-23%"},{"v":-0.2850005732728788,"d":"-29%"},{"v":-0.33731760449681464,"d":"-34%"},{"v":-0.38963463572075036,"d":"-39%"},{"v":-0.38963463572075036,"d":"-39%"}]
["Perdita per l'applicazione del guadagno Insperato",null,{"$f":"+C72","v":{"v":-12145.074988998733,"d":"-12,145.07 "}},{"v":-11369.857436509452,"d":"-11,369.86 "},{"v":-10594.639884020173,"d":"-10,594.64 "},{"v":-9819.42233153089,"d":"-9,819.42 "},{"v":-9044.204779041609,"d":"-9,044.20 "},{"v":-9044.204779041609,"d":"-9,044.20 "}]
["Perdita per l'applicazione della degressività",null,{"$f":"+(C46-C49)*-1","v":{"v":0,"d":"0.00"}},{"v":0,"d":"0.00"},{"v":0,"d":"0.00"},{"v":0,"d":"0.00"},{"v":0,"d":"0.00"},{"v":0,"d":"0.00"}]
["Perdita per il mancato rispetto del greening",null,{"$f":"+C50-C55","v":{"v":0,"d":"0.00"}},{"$f":"+D50-D55","v":{"v":0,"d":"0.00"}},{"$f":"+(E49+E50)-(E54+E55)","v":{"v":0,"d":"0.00"}},{"$f":"+(F49+F50)-(F54+F55)","v":{"v":0,"d":"0.00"}},{"$f":"+(G49+G50)-(G54+G55)","v":{"v":0,"d":"0.00"}},{"$f":"+(H49+H50)-(H54+H55)","v":{"v":0,"d":"0.00"}}]
[]
[]
["Titolo giovani agricoltore Ante Guadagno Insperato",null,{"$f":"+IF(AND($D$10=\"si\",OR($D$11=2011,$D$11=2012,$D$11=2013,$D$11=2014,$D$11=2015)),IF($D$6<90,C$44*0.25,C$44/$D6*90*0.25),0)","v":{"v":0,"d":"0.00"}},{"v":0,"d":"0.00"},{"v":0,"d":"0.00"},{"v":0,"d":"0.00"},{"v":0,"d":"0.00"},{"v":0,"d":"0.00"}]
[]
["Effetto Guadagno Insperato"]
["Tipologie pagamenti",null,2015,2016,2017,2018,2019,2020]
["Perdita pagamento di Base",null,{"$f":"+(C45-C44)/2","v":{"v":-7966.486397718733,"d":"-7,966.49 "}},{"v":-7457.987265949452,"d":"-7,457.99 "},{"v":-6949.488134180172,"d":"-6,949.49 "},{"v":-6440.989002410891,"d":"-6,440.99 "},{"v":-5932.48987064161,"d":"-5,932.49 "},{"v":-5932.48987064161,"d":"-5,932.49 "},null,"Convalida dati Giovane agricoltore"]
["Perdita greening",null,{"$f":"+C69*0.3/$D$23","v":{"v":-4178.5885912799995,"d":"-4,178.59 "}},{"v":-3911.8701705599997,"d":"-3,911.87 "},{"v":-3645.1517498400003,"d":"-3,645.15 "},{"v":-3378.4333291199996,"d":"-3,378.43 "},{"v":-3111.7149084,"d":"-3,111.71 "},{"v":-3111.7149084,"d":"-3,111.71 "}]
["Giovani agricoltori",null,{"$f":"+(C56-C65)/2","v":{"v":0,"d":"0.00"}},{"v":0,"d":"0.00"},{"v":0,"d":"0.00"},{"v":0,"d":"0.00"},{"v":0,"d":"0.00"},{"v":0,"d":"0.00"},{"$nulls":3},"Giovane agricoltore","Si","No"]
["Totale",null,{"$f":"SUM(C69:C71)","v":{"v":-12145.074988998733,"d":"-12,145"}},{"v":-11369.857436509452,"d":"-11,370"},{"v":-10594.639884020173,"d":"-10,595"},{"v":-9819.42233153089,"d":"-9,819"},{"v":-9044.204779041609,"d":"-9,044"},{"v":-9044.204779041609,"d":"-9,044"}]
[{"$nulls":12},"Prima del 2011"]
[{"$nulls":12},2011]
[{"$nulls":12},2012]
[{"$nulls":12},2013]
["Effetti sul Pagamento Greening in relazione alle scelte",null,2015,2016,2017,2018,2019,2020,{"$nulls":4},2014]
["Riduzione superficie non rispetto greening",null,{"$f":"IF($G31=\"No\",'Maschera di Calcolo'!$D30,Diversificazione!$C80)","v":{"$error":"#DIV/0!"}},{"$f":"IF($G31=\"No\",'Maschera di Calcolo'!$D30,Diversificazione!$C80)","v":{"$error":"#DIV/0!"}},{"$f":"IF($G31=\"No\",'Maschera di Calcolo'!$D30,Diversificazione!$C80)","v":{"$error":"#DIV/0!"}},{"$f":"IF($G31=\"No\",'Maschera di Calcolo'!$D30,Diversificazione!$C80)","v":{"$error":"#DIV/0!"}},{"$f":"IF($G31=\"No\",'Maschera di Calcolo'!$D30,Diversificazione!$C80)","v":{"$error":"#DIV/0!"}},{"$f":"IF($G31=\"No\",'Maschera di Calcolo'!$D30,Diversificazione!$C80)","v":{"$error":"#DIV/0!"}},{"$nulls":4},2015]
["Netto SAU soggetto a pagamento greening",null,{"$f":"+$D30-C78","v":{"$error":"#DIV/0!"}},{"$error":"#DIV/0!"},{"$error":"#DIV/0!"},{"$error":"#DIV/0!"},{"$error":"#DIV/0!"},{"$error":"#DIV/0!"},{"$nulls":4},"dal 2016"]
["Sanzioni non rispetto greening olre 50% riduzione superfici",{"$nulls":3},{"$f":"+IF($B82>50,((E50/$D30*E78)/5),0)","v":{"$error":"#DIV/0!"}},{"$f":"+IF($B82>50,((F50/$D30*F78)/4),0)","v":{"$error":"#DIV/0!"}},{"$f":"+IF($B82>50,((G50/$D30*G78)/4),0)","v":{"$error":"#DIV/0!"}},{"$f":"+IF($B82>50,((H50/$D30*H78)/4),0)","v":{"$error":"#DIV/0!"}}]
[]
["Riduzione (%) superfici oggetto di pagamento greening",{"$f":"+Diversificazione!C83","v":{"$error":"#DIV/0!"}}]
[]
["Autori: Angelo Frascarelli, Gabriele Chiodini, Stefano Ciliberti"]
[]
[]
[]
[]
["Informativa sulla licenza: ","http://creativecommons.org/licenses/by-nc-sa/4.0/legalcode"]
["Informativa sull'esonero da responsabilità:","http://creativecommons.org/licenses/by-nc-sa/4.0/"]

{"sheet":"Pagamento accoppiato","index":2,"n_rows":32,"n_cols":8,"rows_kept":32,"merged":[[0,0,0,7],[1,0,2,0],[1,1,2,1],[1,2,2,2],[1,3,1,4],[3,0,5,0],[6,0,9,0],[11,0,12,0],[13,0,16,0],[20,0,22,0],[23,0,23,6],[27,0,27,7]]}
["PAGAMENTI ACCOPPIATI (art. 57 reg. 1307/2013)"]
["SETTORI","MISURA","TERRITORIO","PLAFOND",null,"IMPORTO STIMATO","CONSISTENZA","TOTALE"]
[{"$nulls":3},"Milioni di euro","%","euro/capo o euro/ha","v.a.","€"]
["LATTE","Premi alle vacche da latte","nazionale",75.11,17.5,56,null,{"$f":"+G4*F4","v":0}]
[null,"Premi aggiuntivi alle vacche da latte in zone montane","nazionale",9.87,2.3,40,null,{"$f":"+G5*F5","v":0}]
[null,"Premi alle bufale","nazionale",4.12,0.96,20,null,0]
["CARNE","Premi alle vacche nutrici ","nazionale",40.78,9.5,202,null,0]
[null,"Vacche nutrici di razza Chianina, Maremmana, Marchigiana, Romagnola, Podolica in allevamenti che aderiscono a piani di risanamento da IBR","nazionale",null,null,{"$f":"+F7*0.2","v":40.400000000000006},null,0]
[null,"Premi ai bovini macellati 12-24 mesi ","nazionale",66.96,15.6,46,null,0]
[null,"Bovini macellati allevati per almeno 12 mesi nelle aziende dei richiedenti o aderenti a sistema di qualità nazionale o regionale o a sistemi di etichettatura facoltativi riconosciuti","nazionale",null,null,{"$f":"+F9*0.3","v":13.799999999999999},null,0]
[null,"Bovini macellati con certificazione IGP","nazionale",null,null,{"$f":"+F9*0.5","v":23},null,0]
["OVI-CAPRINO","Premi alle agnelle","nazionale",9.49,2.21,12,null,0]
[null,"Premi a capi ovi-caprini macellati certifica DOP o IGP","nazionale",5.54,1.29,10,null,0]
["FRUMENTO DURO, COLTURE PROTEICHE E PROTEAGINOSE","Premi alla coltivazione di soia","Piemonte, Lombardia, Veneto, Friuli, Emilia Romagna",9.87,2.3,97,null,{"$f":"+IF(G14<=5,G14*F14,(F14*5+(G14-5)*0.1*F14))","v":0}]
[null,"Premi alla coltivazione di frumento duro","Toscana, Umbria, Marche, Lazio, Abruzzo, Molise, Campania, Puglia, Basilicata, Calabria, Sicilia, Sardegna",59.88,13.95,60,null,0]
[null,"Premi alla coltivazione di colture proteoleaginose","Toscana, Umbria, Marche, Lazio",14.16,3.3,80,null,0]
[null,"Premi alla coltivazione di leguminose da granella","Abruzzo, Molise, Campania, Puglia, Basilicata, Calabria, Sicilia, Sardegna",11.8,2.75,90,null,0]
["RISO","Premi alla coltivazione di riso","nazionale",22.75,5.3,120,null,0]
["BARBABIETOLA","Premi alla coltivazione di barbabietola da zucchero","nazionale",17.21,4.01,325,null,0]
["POMODORO DA INDUSTRIA","Premi alla coltivazione di pomodoro da industria","nazionale",11.3,2.63,160,null,0]
["OLIO DI OLIVA","Premi alle superfici olivicole","Liguria, Puglia, Calabria",44.29,10.3,78,null,0]
[null,"Premi alle superfici olivicole con una pendenza media superiore al 7,5%","Puglia, Calabria",13.31,3.1,70,null,0]
[null,"Premi alle superfici olivicole di particolare rilevanza economica, sociale, territoriale e ambientale","nazionale",12.88,3,130,null,0]
["TOTALE",{"$nulls":6},{"$f":"SUM(H4:H23)","v":0}]
[]
[]
[]
["Autori: Angelo Frascarelli, Gabriele Chiodini, Stefano Ciliberti"]
[]
[]
["Informativa sulla licenza: ","http://creativecommons.org/licenses/by-nc-sa/4.0/legalcode"]
["Informativa sull'esonero da responsabilità:","http://creativecommons.org/licenses/by-nc-sa/4.0/"]

{"sheet":"Diversificazione","index":3,"n_rows":85,"n_cols":6,"rows_kept":85,"hidden":true,"merged":[[0,0,0,2],[1,0,1,2],[2,0,2,2],[3,0,3,1],[4,0,4,1],[5,0,5,1],[5,3,7,3],[6,0,6,1],[7,0,7,1],[8,0,8,1],[9,0,9,1],[10,0,10,1],[11,0,11,1],[12,0,12,1],[13,0,13,1],[14,0,14,1],[15,0,15,1],[16,0,16,1],[17,0,17,1],[18,0,18,2],[23,0,23,2],[24,0,24,1],[25,0,25,1],[26,0,26,2],[27,0,27,1],[28,0,28,1],[29,0,29,1],[30,0,30,1],[31,0,31,1],[32,0,32,1],[33,0,33,1],[34,0,34,2],[35,0,35,1],[36,0,36,1],[37,0,37,1],[38,0,38,1],[40,0,40,2],[41,0,41,1],[45,0,45,1],[79,0,79,1],[84,0,84,1]]}
["Sistema di Calcolo del rispetto del Greening"]
["® Angelo Frascarelli, Gabriele Chiodini, Stefano Ciliberti"]
["Dati dell'azienda"]
["SAU (ha)",null,{"$f":"+'Maschera di Calcolo'!D30","v":15}]
["L'azienda è biologica?",null,"No"]
["Seminativi (ha)",null,null,{"$f":"+IF((C6+C7+C8)>C4,\"Attenzione la superficie a seminativi non può oltrepassare la SAU\",\"\")","v":""}]
["Colture Permanenti Legnose (ha)"]
["Prati permanenti (ha)"]
["Prati Permanenti convertiti nel 2015 senza autorizzazione (ha)"]
["L'azienda possiede superfici con colture sommerse, destinate ad erba o piante erbacee da foraggio, a riposo o con leguminose?",null,"Si"]
["Indicare la superficie con colture sommerse (ha)"]
["Indicare la superficie a erba o altre piante erbacee da foraggio (ha)"]
["Indicare la superficie a riposo (ha)"]
["Indicare la superficie a leguminose (ha)"]
["Numero di colture praticate sui seminativi (v.a.)"]
["Indicare la superficie occupata alla coltura principale (ha)",null,5,{"$f":"IF(AND((C13+C12)/C6>0.75,C16=\"\",C32=\"No\",C34=\"No\"),\"Inserire il valore della superficie occupata dalla coltura principale, escludendo gli erbai, le foraggere e i terreni a riposo, poiché già indicati\",\"\")","v":{"$error":"#DIV/0!"}}]
["Indicare la superficie occupata alla seconda coltura (ha)"]
["Superficie destinata ad Ecological Focus Area (mq)",null,"Premere Qui",null,null,"                                                                                                                                                                                                 "]
[{"$f":"#VALUE!","v":{"$error":"#VALUE!"}}]
[]
[]
["Convalida dati","Si","No"]
[]
["Altre condizioni "]
["Azienda in cui i seminativi sono occupati per più del 75% da ebai, foraggere o a riposo.",null,{"$f":"+IF((C13+C12)/C6>0.75,\"Si\",\"No\")","v":{"$error":"#DIV/0!"}}]
["Azienda in cui i seminativi rimanenti (non occupati da ebai, foraggere o a riposo) sono occupati al massimo per il 75% da una coltura",null,{"$f":"+IF(C25=\"Si\",IF(AND(C16<>0,C16/(C6-(C13+C12))<0.75),\"Si\",\"No\"))","v":{"$error":"#DIV/0!"}}]
["Esoneri "]
["Azienda senza seminativi e prati permamenti, greening per definizione",null,{"$f":"+IF(AND(C4>0,C6=\"\",C9=\"\"),\"Si\",\"No\")","v":"Si"}]
["Azienda senza seminativi, esonerata dall'obbligo della diversificazione e delle EFA",null,{"$f":"+IF(AND(C4>0,C6=\"\"),\"Si\",\"No\")","v":"Si"}]
["Azienda esonerata dalla diversificazione perché ha medo di 10 ha diseminativi",null,{"$f":"+IF(AND(C4>0,C6<=10),\"Si\",\"No\")","v":"Si"}]
["Azienda esonerata dalle EFA perché ha medo di 15 ha diseminativi",null,{"$f":"+IF(AND(C4>0,C6<15),\"Si\",\"No\")","v":"Si"}]
["Esonerata dalla diversificazione (art. 44-3a) e EFA (46-4b)",null,{"$f":"+IF(AND((C12+C13)/C6>0.75,(C6-(C13+C12)<30)),\"Si\",\"No\")","v":{"$error":"#DIV/0!"}}]
["Esonerata dalle EFA (46-4b)",null,{"$f":"+IF(AND((C14+C12+C13)/C6>0.75,(C6-(C14+C13+C12)<30)),\"Si\",\"No\")","v":{"$error":"#DIV/0!"}}]
["Esonerata dalla diversificazione (artr. 44-3b) e EFA (46-4b)",null,{"$f":"+IF(AND((C12+C11+C9)/C4>0.75, (C4-(C12+C11+C9)<30)),\"Si\",\"No\")","v":"No"}]
["Controllo dati"]
["Superamento SAU",null,{"$f":"+IF((C6+C9)>C4,\"Superamento SAU\",\"Ok\")","v":"Ok"}]
["Superamento SAU",null,{"$f":"+IF((C9+C12+C11)>C4,\"Superamento SAU\",\"Ok\")","v":"Ok"}]
["Superamento seminativi-1",null,{"$f":"+IF((C16+C17)>C6,\"Superamento seminativi\",\"Ok\")","v":"Superamento seminativi"},1]
["Superamento seminativi-2",null,{"$f":"+IF((C12+C13)>C6,\"Superamento seminativi\",\"Ok\")","v":"Ok"}]
[]
["Risultato"]
["Requisiti da rispettare",null,"Rispetto dei requisiti da parte dell'azienda"]
["Diversificazione",{"$f":"+IF(C5=\"Si\",\"No\",IF(C4=\"\",\"n.d.\",IF(C6=\"\",\"No\",IF(OR(C6<=10,C32=\"Si\",C34=\"Si\"),\"No\",IF(C25=\"Si\",\"Si, almeno 2 colture\",IF(AND(C6>10,C6<=30),\"Si, almeno 2 colture\",\"Si, almeno 3 colture\"))))))","v":"No"},{"$f":"+IF(B43=\"No\",\"Si\",IF(C4=\"\",\"n.d.\",IF(C26=\"Si\",\"Si\",IF(OR(C15=\"\",C16=\"\"),\"Dati insufficienti\",IF(AND(C15>=2,B43=\"Si, almeno 2 colture\", C16/C6<=0.75),\"Si\",IF(C17=\"\",\"No\",IF(AND(C15>=3,C16/C6<=0.75,(C16+C17)/C6<=0.95,C16>0),\"Si\",\"No\")))))))","v":"Si"}]
["Prati e pascoli permanenti",{"$f":"+IF(C5=\"Si\",\"No\",IF(C9=\"\",\"No\",IF(C9>0,\"Si\",\"No\")))","v":"No"},{"$f":"+IF(B44=\"No\",\"Si\",IF(C9>0,\"No\",))","v":"Si"}]
["Introduzione Ecological Focus Area",{"$f":"+IF(C5=\"Si\",\"No\",IF(C4=\"\",\"n.d.\",IF(C6=\"\",\"No\",IF(OR(C33=\"Si\",C34=\"Si\"),\"No\",IF(C6>15,\"Si\",\"No\")))))","v":"No"},{"$f":"+IF(B45=\"No\",\"Si\",IF(C4=\"\",\"n.d.\",IF(AND(B45=\"Si\",EFA!G25/Diversificazione!C6<0.05),\"No\",\"Si\")))","v":"Si"}]
["Rispetto del Greening:",null,{"$f":"+IF(C5=\"Si\",\"Si\",IF(C4=\"\",\"n.d.\",IF(AND(C43=\"Si\",C44=\"Si\",C45=\"Si\"),\"Si\",\"No\")))","v":"Si"}]
[]
["Ripartizione % superfici",{"$f":"+C6*0.75","v":0},{"$f":"+C6*0.2","v":0}]
[]
["Diversificazione: Superamento soglia del 75% coltura principale",null,75,"soglia"]
["% Coltura principale",null,{"$f":"+C16/C6*100","v":{"$error":"#DIV/0!"}}]
["Superficie da destinare ad altre colture",null,{"$f":"0.25*C6","v":0}]
["Tasso di differenza",null,{"$f":"+(C16-B48)/C52","v":{"$error":"#DIV/0!"}},"eccedenza limite /superficie altre colture"]
["Riduzione superficie pagamenti (ha)",null,{"$f":"+C6*0.5*C53","v":{"$error":"#DIV/0!"}},"Superfici a seminativi X 0,5 X tasso di differenza"]
[]
["Diversificazione: superamento soglia del 95% delle 2 colture",null,95,"soglia"]
["% Colture principali",null,{"$f":"+(C16+C17)/C6*100","v":{"$error":"#DIV/0!"}}]
["Superficie da destinare ad altre colture",null,{"$f":"+C6*0.05","v":0}]
["Tasso di differenza",null,{"$f":"+((C16+C17)-(B48+C48))/C58","v":{"$error":"#DIV/0!"}},"eccedenza limite /superficie altre colture"]
["Riduzione superficie pagamenti (ha)",null,{"$f":"+C6*0.5*C59","v":{"$error":"#DIV/0!"}},"Superfici a seminativi X 0,5 X tasso di differenza"]
[]
["Diversificazione: superamento soglia del 75% prima coltura e del 95% delle 2 colture"]
["% coltura principale",null,{"$f":"+C16/C6*100","v":{"$error":"#DIV/0!"}}]
["% Coltura secondaria",null,{"$f":"+C17/C6*100","v":{"$error":"#DIV/0!"}}]
["Superficie da destinare ad altre colture",null,{"$f":"+C6*0.05","v":0}]
["Tasso di differenza",null,{"$f":"+IF(C59+C53>1,1,C59+C53)","v":{"$error":"#DIV/0!"}},"eccedenza limite /superficie altre colture"]
["Riduzione superficie pagamenti (ha)",null,{"$f":"+C6*0.5*C66","v":{"$error":"#DIV/0!"}},"Superfici a seminativi X 0,5 X tasso di differenza"]
[]
["Riduzione superficie pagamenti da considerare per non rispetto diversificazione",null,{"$f":"+IF(AND(C51>C50,C57>C56),C67,IF(C51>C50,C54,IF(C57>C56,C60,0)))","v":{"$error":"#DIV/0!"}}]
[]
[]
["Prati permanenti"]
["Riduzione superficie pagamenti da considerare per non rispetto prati permanenti",null,{"$f":"+C9","v":0}]
[]
["Aree di interesse ecologico"]
["EFA richiesta",null,{"$f":"+C6*0.05","v":0}]
["Tasso di differenza",null,{"$f":"+(C76-EFA!G25)/C76","v":{"$error":"#DIV/0!"}}]
["Riduzione superficie pagamenti da considerare per non rispetto EFA (ha)",null,{"$f":"+IF(B45=\"No\",0,IF(C76>EFA!G25,C6*0.5*C77,0))","v":0}]
[]
["Riduzione totale superficie pagamenti da considerare per non rispetto greening (ha)",null,{"$f":"+C78+C73+C69","v":{"$error":"#DIV/0!"}}]
[]
["Sanzioni"]
["Riduzione percentuale superficie di calcolo",null,{"$f":"+C80/C4*100","v":{"$error":"#DIV/0!"}}]
["Superficie da utilizzare per il calcolo del pagamento greening se differenza non è maggiore del 20%",null,{"$f":"+C80*2","v":{"$error":"#DIV/0!"}}]
["Riduzione totale superficie considerando le sanzioni (ha)",null,{"$f":"+IF(OR(C83<3,C80<2),C80,IF(C83<20,C84,IF(C83>20,C4)))","v":{"$error":"#DIV/0!"}}]

{"sheet":"EFA","index":4,"n_rows":26,"n_cols":8,"rows_kept":26,"hidden":true,"merged":[[0,0,0,6],[4,0,4,6],[23,0,24,4]]}
["Calcolo Ecological Focus Area"]
["Elementi di EFA","U.M.","Efa Superficie prima della conversione","Fattore di conversione (m/albero/m²)","Fattore di ponderazione","Efa \n(se si applicano entrambi i fattori)","Superficie Efa convertita \n(m2)"]
["Terreni lasciati a riposo (per m²).","m2",null,"n.p.",1,"1 m2",{"$f":"+C3*E3","v":0}]
["Terrazze","ml",null,2,1,"2 m2",{"$f":"+C4*D4*E4","v":0}]
["Elementi caratteristici del paesaggio:"]
["    a) Siepi/fasce alberate","ml",null,5,2,"10 m2",{"$f":"+C6*D6*E6","v":0}]
["    b) Alberi isolati ","v.a.",null,20,1.5,"30 m2",{"$f":"+C7*D7*E7","v":0}]
["    c) Alberi in filari ","ml",null,5,2,"10 m2",0]
["    d)  Gruppi di alberi/ boschetti","m2",null,"n.p.",1.5,"1,5 m2",{"$f":"+C9*E9","v":0},{"$f":"+IF(C9>3000,\"Attenzione la superficie non può oltrepassare gli 0,3 ha\",\"\")","v":""}]
["    e)  Bordi dei campi","ml",null,6,1.5,"9 m2",0]
["    f)   Stagni","m2",null,"n.p.",1.5,"1,5 m2",{"$f":"+C11*E11","v":0}]
["    g)  Fossati","ml",null,3,2,"6 m2",0]
["    h)  Muretti di pietra tradizionali","ml",null,1,1,"1 m2",0]
["    i)  Altri elementi caratteristici adiacenti ai seminativi dell’azienda ","m2",null,"n.p.",1,"1 m2",{"$f":"+C14*E14","v":0}]
["Fasce tampone","ml",null,6,1.5,"9 m2",0]
["Ettari agroforestali","m2",null,"n.p.",1,"1 m2",{"$f":"+C16*E16","v":0}]
["Fasce di ettari ammissibili lungo i bordi forestali: ","ml",{"$nulls":4},0]
["ü  Senza produzione","ml",null,6,1.5,"9 m2",0]
["ü  Con produzione","ml",null,6,0.3,"1,8 m2",0]
["Superfici con bosco ceduo a rotazione rapida","m2",null,"n.p",0.3,"0,3 m2",{"$f":"+C20*E20","v":0}]
["Superfici oggetto di imboschimento","m2",null,"n.p.",1,"1 m2",{"$f":"+C21*E21","v":0}]
["Superfici con colture azotofissatrici ","m2",null,"n.p.",0.7,"0,7 m2",{"$f":"+C22*E22","v":0}]
["Superfici con colture intercalari o manto vegetale (*)","m2",null,"n.p.",0.3,"0,3 m2"]
["Totale=",{"$nulls":4},"m2",{"$f":"SUM(G3:G23)","v":0}]
[{"$nulls":5},"ha",{"$f":"+G24/10000","v":{"v":0,"d":"0.00"}}]
["(*) L'Italia ha deciso di non utilizzare questo elemento di EFA."]